Tag: android gradle

Errore: il nome del file deve terminare con .xml o .png quando si utilizza un file mp3

Sto utilizzando Gradle 1.5.0 con Android Studio. Il progetto sincronizza con Gradle senza problemi, ma quando eseguo l'applicazione, ottengo il messaggio di errore di seguito Error:Execution failed for task ':App:mergeDebugResources'. /Users/Zee/Repos/App/res/drawable/notification.mp3: Error: The filename must end with .xml or .png Utilizzando un file mp3, quindi non sappiate cosa fare a questo punto. Ogni aiuto è […]

Come evitare il command di build di Cordova da generare automaticamente settings.gradle

Ho creato un'applicazione Cordova con un settings.gradle personalizzato come segue: // GENERATED FILE – DO NOT EDIT include ":" include ":CordovaLib" include 'manager' project(':manager').projectDir = new File('libs/ConnectManager') e in build.gradle, posso fare riferimento a come: dependencies { compile fileTree(dir: 'libs', include: '*.jar') // SUB-PROJECT DEPENDENCIES START debugCompile project(path: "CordovaLib", configuration: "debug") releaseCompile project(path: "CordovaLib", configuration: […]

Gradle Errore: duplica la voce: com / android / volley / AuthFailureError.class

Ho importto EBS Sdk nel mio progetto. Ora la costruzione di gradle è successo ma mentre funziona Error:Execution failed for task':app:transformClassesWithJarMergingForDebug'. > com.android.build.api.transform.TransformException: java.util.zip.ZipException: duplicate entry: com/android/volley/AuthFailureError.class** questa exception si verifica. Quello che segue è il build.gradle di entrambi app e il module che ho cercato e provato tutte le possibilità ma non sto ottenendo […]

Imansible risolvere: com.facebook.android:facebook-android-sdk:4.0.0

Sto usando Android Studio 1.1.0 che ho seguito questo link https://developers.facebook.com/docs/android/getting-started/ ma ottenendo errori Imansible risolvere: com.facebook.android:facebook-android-sdk:4.0 .0 in tutorial mavenCentral () è presente nei repository di script di build ma nello studio di Android è jcenter () ho provato a cambiare i repository anche seguito stackoverflow Q & A riguardo a questa domanda ma […]

Perché i pacchetti dal module di libreria non esistono durante la compilazione, anche quando Android Studio non mostra alcun errore nel codice?

Ho un module di libreria (AndEngine) all'interno della mia cartella / AndEngine. Il codice da quello che compila bene. Nel mio file root settings.gradle ho questo: include ':app:libs:AndEngine' include ':app' E poi nel file build.gradle della mia app ho questo in dependencies: compile project('libs:AndEngine') Nel codice del mio app, tutte le importzioni e persino autocompletamento […]

Android Studio non funziona mentre crea l'applicazione utilizzando AppCompat v23 e API21

Sto usando la versione 1.3 di Android e SDK per 5.0.1. Ho decretato perché each volta che costruisco il progetto lancia un errore. Può chiunque dirlo dettagliatamente come farlo .. Errore: Information:Gradle tasks [:app:assembleDebug] :app:preBuild UP-TO-DATE :app:preDebugBuild UP-TO-DATE :app:checkDebugManifest :app:preReleaseBuild UP-TO-DATE :app:prepareComAndroidSupportAppcompatV72300Library UP-TO-DATE :app:prepareComAndroidSupportSupportV42300Library UP-TO-DATE :app:prepareDebugDependencies :app:compileDebugAidl UP-TO-DATE :app:compileDebugRenderscript UP-TO-DATE :app:generateDebugBuildConfig UP-TO-DATE :app:generateDebugAssets UP-TO-DATE :app:mergeDebugAssets […]

Errore Gradle quando si preme "eseguire applicazione" – Android Studio 0.4.3

Ho trovato questo errore quando premo "eseguire l'applicazione". Ho cercato una correzione negli ultimi due giorni, puoi aiutarmi? Ho installato Android Studio 0.4.3, questo problema è iniziato quando la mia scuola aggiorna Java sul mio computer scolastico. org.gradle.tooling.GradleConnectionException: Imansible creare un'istanza di implementazione API Tooling utilizzando la distribuzione Gradley specificata ' http://services.gradle.org/distributions/gradle-1.9-all.zip '.: Imansible creare […]

Studio Android con gradile sperimentale 0.2.0

Sto cercando di installare una ndk build di base con l'ultima versione dello studio android in questo momento. Cercando di seguire questo tutorial Questo è il mio gradle-wrapper.properties #Thu Sep 17 14:22:34 CST 2015 distributionBase=GRADLE_USER_HOME distributionPath=wrapper/dists zipStoreBase=GRADLE_USER_HOME zipStorePath=wrapper/dists distributionUrl=https\://services.gradle.org/distributions/gradle-2.5-all.zip Questo è il progetto build.gradle // Top-level build file where you can add configuration options common […]

mentre implemento il progetto mi trovo affrontato "Il tuo progetto contiene file C ++ ma non utilizza un sistema di compilazione nativo supportto".

Errore: l'esecuzione non è rioutput per l'attività ': app: compileDebugNdk'. Errore: il tuo progetto contiene file C ++ ma non utilizza un sistema di ripristino nativo supportto. Prendi in considerazione l'integrazione di CMake o ndk-build con il plug-in stabile di Android Gradle: https://developer.android.com/studio/projects/add-native-code.html oppure utilizza il plugin sperimentale: http://tools.android. com / tech-docs / nuovo-build-system / […]

Android Studio Gradle Errore – preDexDebug

Recentemente ho aggiunto una nuova attività al mio studio in studio di android e adesso sto ottenendo un errore quando cerco di eseguirlo. Si costruisce bene, ma ho l'errore di seguito quando l'ho eseguito: FAILURE: Build failed with an exception. * What went wrong: Execution failed for task ':app:preDexDebug'. > com.android.ide.common.internal.LoggedErrorException: Failed to run command: […]

L'Android è un fan Android di Google, tutto su telefoni Android, Android Wear, Android Dev e applicazioni Android Games e così via.